{"text_format":"1","workbook":"xlsx","n_sheets":8,"sheets":["Project Information","Prescriptive Compliance Form","Part 3 -  Details","Part 4 - Details","Part 5 - Details","Part 6 - Details","Validation Reference Page 1","Code Tables"],"not_rendered":{"charts":0,"images":6,"macros":1,"external_links":2,"defined_names":34,"comments":0,"pivot_tables":0},"unopened":[],"bounds":{"document_bytes":16777216,"sheet_cells":100000,"rows_first":2000,"rows_last":500,"rows_between":2000,"halvings":0,"cell_chars":16384,"cell_head_chars":4096},"cells_cut":0,"cells_raw":0,"read":"whole","date_system":"1900"}

{"sheet":"Project Information","index":0,"n_rows":47,"n_cols":9,"rows_kept":47,"cut":false,"hidden":false,"merged":[[28,3,28,6],[22,3,22,6],[26,3,26,6],[26,0,26,1],[27,0,27,1],[28,0,28,1],[23,0,23,1],[23,3,23,6],[25,3,25,6],[25,0,25,1],[22,0,22,1],[30,0,30,8],[18,2,18,6],[29,0,29,1],[21,0,21,1],[29,3,29,6],[21,3,21,6],[20,0,20,1],[20,3,20,6],[19,0,19,1],[19,3,19,6],[18,0,18,1],[13,7,29,8],[13,0,13,1],[16,0,16,1],[27,3,27,6],[13,2,13,6],[12,0,12,6],[24,0,24,1],[24,3,24,6],[0,0,2,8],[3,0,3,8],[4,0,4,8],[5,0,10,8],[11,0,11,8],[16,2,16,6],[17,0,17,1],[17,2,17,6],[15,0,15,1],[15,2,15,6],[14,0,14,1],[14,2,14,6]]}
["NECB 2020 Abridged Prescriptive Path Checklist"]
[]
[]
["About this Document"]
[]
["This form prompts building permit applicants for information required by the authority having jurisdiction (AHJ) to support verification of compliance to the National Energy Code for Buildings (NECB) 2020 and complements other required submissions of the building permit application. It is an abridged version of the checklist and is intended to provide the AHJ with minimum summary information for the prescriptive path only. \nThe form is to be used in conjunction with the NECB 2020. Any textual interpretation will apply only to the specific language of the NECB 2020.\nThis is a template document suitable for modification by the AHJs. It was developed for Microsoft Excel versions 2010 and 2013. Use of earlier versions of Microsoft Excel may not be supported. Please complete all three tabs (sheets) including all information below as some of these inputs are needed for functionality of the form. Blue cells are input cells. \n\n\n"]
[]
[]
[]
[]
[]
["Building Information","building information"]
["\n",null,null,null,null,null,null,"Building Permit Number"," (for internal use only)"]
["Date (yyyy-mm-dd)",null,null,null,null,null,null,"Building Official Notes (for internal use only)"]
["Project Name",null," "]
["Project Address"]
["Contact Person",null," "]
["Contact Email"]
["Contact Phone Number"]
["Type of Project"]
{"$rows_left_out":28}
{"sheet":"Prescriptive Compliance Form","index":1,"n_rows":48,"n_cols":9,"rows_kept":48,"cut":false,"hidden":false,"merged":[[0,8,5,8]]}
[{"$f":"'Project Information'!A15","v":"Project Name"},{"$f":"'Project Information'!C15","v":" "}]
[{"$f":"'Project Information'!A14:B14","v":"Date (yyyy-mm-dd)"},{"$f":"'Project Information'!C14","v":"00:00:00"}]
[{"$f":"'Project Information'!A17:B17","v":"Contact Person"},{"$f":"'Project Information'!C17","v":" "}]
["Climate Zone",{"$f":"'Project Information'!C30","v":""}]
[null,{"$f":"IF('Project Information'!C22=\"\", \"\", IF('Project Information'!C22= \"No\", \"Fully Heated Building\", \"Semi-heated Building\"))","v":""}]
["Building Permit Number",{"$f":"'Project Information'!I13","v":" (for internal use only)"}]
[]
["#","Question",null,null,"Requirements","Units",null,"Compliant?","Additional Comments"]
[null,"Part 3 - Building Envelope - Prescriptive Requirements"]
[1,{"$f":"CONCATENATE(C10,E10,F10,D10)","v":"The calculations of overall thermal transmittance of assemblies for the purpose of comparison with the provisions in Section 3.2. account for the effect of thermal bridging, as required by Article 3.1.1.7."},"The calculations of overall thermal transmittance of assemblies for the purpose of comparison with the provisions in Section 3.2. account for the effect of thermal bridging, as required by Article 3.1.1.7.",null,null,null,{"$f":"IF(OR(H10=\"N/A\",H10=\"Yes\")=TRUE, 1, 0)","v":0}]
[2,{"$f":"IF(ISNA(E11),\"Project Information Tab Incomplete\",CONCATENATE(C11,E11,F11,D11))","v":"Project Information Tab Incomplete"},"The building's FDWR is less than or equal to "," as per the requirements of Article 3.2.1.4. NB: field automatically updates based on the information entered in the Project Information Sheet.",{"$f":"ROUND(VLOOKUP(1,  'Code Tables'!A16:G17,VLOOKUP('Project Information'!C30,'Validation Reference Page 1'!C2:D7,2,FALSE)),2)","v":{"$error":"#N/A"}},null,{"$f":"IF(OR(H11=\"N/A\",H11=\"Yes\")=TRUE, 1, 0)","v":0},{"$f":"IF(ISNA(E11), \"Project Information Tab Incomplete\", IF(AND('Project Information'!C23<>0, 'Project Information'!C24<>\"\", 'Project Information'!C25<>\"\"), IF(E11>=(('Project Information'!C24+'Project Information'!C25)/'Project Information'!C23),\"Yes\",\"No\"),\"Project Information Tab Incomplete\"))","v":"Project Information Tab Incomplete"}]
[3,{"$f":"IF(E12=\"\",\"Project Information Tab Incomplete\", IF('Project Information'!C27=0, \"Skylight requirement not applicable.\", CONCATENATE(C12,E12,F12,D12)))","v":"Project Information Tab Incomplete"},"The building's skylight to roof ratio is less than or equal to "," as per the requirements of Article 3.2.1.4. NB: field automatically updates based on the information entered in the Project Information Sheet.",{"$f":"IF(OR(ISBLANK('Project Information'!C27),ISBLANK('Project Information'!C26)),\"\",0.02)","v":""},null,{"$f":"IF(OR(H12=\"N/A\",H12=\"Yes\")=TRUE, 1, 0)","v":0},{"$f":"IF(B12=\"Skylight requirement not applicable.\",\"N/A\",IF(B12=\"Project Information Tab Incomplete\",\"Project Information Tab Incomplete\",IF(AND('Project Information'!C27<>\"\",'Project Information'!C26<>\"\"),IF(E12>=('Project Information'!C27/'Project Information'!C26),\"Yes\",\"No\"),\"No\")))","v":"Project Information Tab Incomplete"}]
[4,{"$f":"IF(ISNA(E13),\"Project Information Tab Incomplete\",CONCATENATE(C13,E13,F13,D13))","v":"Project Information Tab Incomplete"},"Walls have overall thermal transmittances no greater than ",", as specified in Table 3.2.2.2. Please complete the Part 3 - Details sheet.",{"$f":"VLOOKUP(\"Walls\", 'Code Tables'!B4:H4,VLOOKUP('Project Information'!C30,'Validation Reference Page 1'!C2:D7,2,FALSE))","v":{"$error":"#N/A"}}," W/m2∙K",{"$f":"IF(OR(H13=\"N/A\",H13=\"Yes\")=TRUE, 1, 0)","v":0}]
[5,{"$f":"IF(ISNA(E14),\"Project Information Tab Incomplete\",CONCATENATE(C14,E14,F14,D14))","v":"Project Information Tab Incomplete"},"Roofs have overall thermal transmittances no greater than ",", as specified in Table 3.2.2.2. Please complete the Part 3 - Details sheet.",{"$f":"VLOOKUP(\"Roofs\", 'Code Tables'!B5:H5,VLOOKUP('Project Information'!C30,'Validation Reference Page 1'!C2:D7,2,FALSE))","v":{"$error":"#N/A"}}," W/m2∙K",{"$f":"IF(OR(H14=\"N/A\",H14=\"Yes\")=TRUE, 1, 0)","v":0}]
[6,{"$f":"IF(ISNA(E15),\"Project Information Tab Incomplete\",CONCATENATE(C15,E15,F15,D15))","v":"Project Information Tab Incomplete"},"Floors have overall thermal transmittances no greater than ",", as specified in Table 3.2.2.2. Please complete the Part 3 - Details sheet.",{"$f":"VLOOKUP(\"Floors\", 'Code Tables'!B6:H6,VLOOKUP('Project Information'!C30,'Validation Reference Page 1'!C2:D7,2,FALSE))","v":{"$error":"#N/A"}}," W/m2∙K",0]
[7,{"$f":"IF(ISNA(E16),\"Project Information Tab Incomplete\",CONCATENATE(C16,E16,F16,D16))","v":"Project Information Tab Incomplete"},"The overall thermal transmittance of vertical fenestration is not more than ",", as specified in Table 3.2.2.3. Please complete the Part 3 - Details sheet.",{"$f":"VLOOKUP(\"Vertical Fenestration\", 'Code Tables'!J4:P4,VLOOKUP('Project Information'!C30,'Validation Reference Page 1'!C2:D7,2,FALSE))","v":{"$error":"#N/A"}}," W/m2∙K",0]
[8,{"$f":"IF(OR(ISNA(E17), E12=\"\"), \"Project Information Tab Incomplete\", IF('Project Information'!C27=0, \"Skylight requirement not applicable.\",CONCATENATE(C17,E17,F17,D17)))","v":"Project Information Tab Incomplete"},"The overall thermal transmittance of skylights is not more than ",", as specified in Table 3.2.2.3. Please complete the Part 3 - Details sheet.",{"$f":"VLOOKUP(\"Skylights\", 'Code Tables'!J5:P5,VLOOKUP('Project Information'!C30,'Validation Reference Page 1'!C2:D7,2,FALSE))","v":{"$error":"#N/A"}}," W/m2∙K",0]
[9,{"$f":"IF(ISNA(E18),\"Project Information Tab Incomplete\",CONCATENATE(C18,E18,F18,D18))","v":"Project Information Tab Incomplete"},"The overall thermal transmittance of applicable doors is not more than "," as specified by Table 3.2.2.4. Refer to Sentence 3.2.2.4.(3) and 3.2.2.4.(5) for exemptions. Please complete the Part 3 - Details sheet as applicable. ",{"$f":"VLOOKUP(\"All Doors\",'Code Tables'!R4:X4,VLOOKUP('Project Information'!C30,'Validation Reference Page 1'!C2:D7,2,FALSE))","v":{"$error":"#N/A"}}," W/m2∙K",0]
[10,{"$f":"IF(ISNA(E19),\"Project Information Tab Incomplete\",CONCATENATE(C19,E19,F19,D19))","v":"Project Information Tab Incomplete"},"The overall thermal transmittance of walls or portions thereof that are below the exterior ground level and are part of the building envelope is not greater than ",", as specified in Table 3.2.3.1. Please complete the Part 3 - Details sheet as applicable. ",{"$f":"VLOOKUP(\"Walls\",'Code Tables'!Z4:AF4,VLOOKUP('Project Information'!C30,'Validation Reference Page 1'!C2:D7,2,FALSE))","v":{"$error":"#N/A"}}," W/m2∙K",0]
[11,{"$f":"IF(ISNA(E20),\"Project Information Tab Incomplete\",CONCATENATE(C20,E20,F20,D20))","v":"Project Information Tab Incomplete"},"The overall thermal transmittance of below-ground roofs, is not greater than ",", as described in Article 3.2.3.2.",{"$f":"VLOOKUP(\"Roofs\",'Code Tables'!Z5:AF5,VLOOKUP('Project Information'!C30,'Validation Reference Page 1'!C2:D7,2,FALSE))","v":{"$error":"#N/A"}}," W/m2∙K",0]
{"$rows_left_out":29}
{"sheet":"Part 3 -  Details","index":2,"n_rows":7,"n_cols":11,"rows_kept":7,"cut":false,"hidden":false,"merged":[[0,0,0,9],[1,0,1,9]]}
["Part 3 - Details"]
["Please complete the following sheet for all envelope assemblies in the building.\n\n\n\n\n"]
["Assembly #","Assembly Name","Assembly Type\n(Please add unique assembly name)","Design U-Value W/(m2∙K)",null,"Code U-Value W/(m2∙K)","Assembly Separating two Conditioned Spaces","Temperature of Colder Conditioned Space  °C","Temperature of Warmer Conditioned Space °C","January Design Temperature °C",{"$f":"(#REF!-#REF!)/((#REF!-(0.5*#REF!)-(0.5*#REF!))*#REF!)","v":{"$error":"#REF!"}}]
[{"$f":"ROW(A4)-3","v":1},null,null,null,{"$f":"IF(C4=\"\",\"\",VLOOKUP(C4, 'Code Tables'!$B$4:$H$12,VLOOKUP('Project Information'!$C$30,'Validation Reference Page 1'!$C$2:$D$7,2),FALSE))","v":""},{"$f":"IF(C4<>\"\",ROUND(IF(G4=\"Yes\", ((I4-J4)/(I4-(0.5*H4)-(0.5*J4)))*E4,E4),3),\"\")","v":""}]
[2,null,null,null,{"$f":"IF(C5=\"\",\"\",VLOOKUP(C5, 'Code Tables'!$B$4:$H$12,VLOOKUP('Project Information'!$C$30,'Validation Reference Page 1'!$C$2:$D$7,2),FALSE))","v":""},{"$f":"IF(C5<>\"\",ROUND(IF(G5=\"Yes\", ((I5-J5)/(I5-(0.5*H5)-(0.5*J5)))*E5,E5),3),\"\")","v":""}]
[3,null,null,null,{"$f":"IF(C6=\"\",\"\",VLOOKUP(C6, 'Code Tables'!$B$4:$H$12,VLOOKUP('Project Information'!$C$30,'Validation Reference Page 1'!$C$2:$D$7,2),FALSE))","v":""},{"$f":"IF(C6<>\"\",ROUND(IF(G6=\"Yes\", ((I6-J6)/(I6-(0.5*H6)-(0.5*J6)))*E6,E6),3),\"\")","v":""}]
[4,null,null,null,{"$f":"IF(C7=\"\",\"\",VLOOKUP(C7, 'Code Tables'!$B$4:$H$12,VLOOKUP('Project Information'!$C$30,'Validation Reference Page 1'!$C$2:$D$7,2),FALSE))","v":""},{"$f":"IF(C7<>\"\",ROUND(IF(G7=\"Yes\", ((I7-J7)/(I7-(0.5*H7)-(0.5*J7)))*E7,E7),3),\"\")","v":""}]

{"sheet":"Part 4 - Details","index":3,"n_rows":8,"n_cols":12,"rows_kept":8,"cut":false,"hidden":false,"merged":[[0,0,0,6],[1,0,1,4],[2,0,2,1]]}
["Part 4 - Details"]
["Please complete the following sheet either for the building or for each space in the building.",null,null,null,null,"Atrium Height (m)",true]
[null,null,"Select compliance option in Cell D3 -->","Space-by-Space Method"]
["Space #",{"$f":"IF('Part 4 - Details'!$D$3='Validation Reference Page 1'!I7,\"\",\"Space Description\")","v":"Space Description"},{"$f":"IF('Part 4 - Details'!$D$3='Validation Reference Page 1'!I7,\"Building Type\",\"Space Type\")","v":"Space Type"},{"$f":"IF('Part 4 - Details'!$D$3='Validation Reference Page 1'!I7,\"LPD, per Table 4.2.1.5.\",\"LPD, per Table 4.2.1.6\")","v":"LPD, per Table 4.2.1.6"},"Design LPD","LPD Compliant","List Control Type(s) Used, per Table 4.2.1.6.","Atrium Height (m)",null,null,"S-b-S","B-A-M"]
[{"$f":"ROW()-4","v":1},null,null,{"$f":"IF($G$2=TRUE, K5, L5)","v":""},null,{"$f":"IF(AND(C5<>\"\", E5<>\"\"),IF(D5>=E5,\"Yes\",\"No\"),\"\")","v":""},null,5,null,null,{"$f":"IF(C5<>\"\", VLOOKUP(C5,'Code Tables'!$I$51:$J$164,2,FALSE), \"\")","v":""},{"$f":"IF(C5<>\"\", VLOOKUP(C5,'Code Tables'!$I$18:$J$50,2,FALSE),\"\")","v":""}]
[{"$f":"ROW()-4","v":2},null,null,{"$f":"IF($G$2=TRUE, K6, L6)","v":""},null,{"$f":"IF(AND(C6<>\"\", E6<>\"\"),IF(D6>=E6,\"Yes\",\"No\"),\"\")","v":""},null,null,null,null,{"$f":"IF(C6<>\"\", VLOOKUP(C6,'Code Tables'!$I$51:$J$164,2,FALSE), \"\")","v":""}]
[3,null,null,{"$f":"IF($G$2=TRUE, K7, L7)","v":""},null,{"$f":"IF(AND(C7<>\"\", E7<>\"\"),IF(D7>=E7,\"Yes\",\"No\"),\"\")","v":""},null,null,null,null,{"$f":"IF(C7<>\"\", VLOOKUP(C7,'Code Tables'!$I$51:$J$164,2,FALSE), \"\")","v":""}]
[4,null,null,{"$f":"IF($G$2=TRUE, K8, L8)","v":""},null,{"$f":"IF(AND(C8<>\"\", E8<>\"\"),IF(D8>=E8,\"Yes\",\"No\"),\"\")","v":""},null,null,null,null,{"$f":"IF(C8<>\"\", VLOOKUP(C8,'Code Tables'!$I$51:$J$164,2,FALSE), \"\")","v":""}]

{"sheet":"Part 5 - Details","index":4,"n_rows":7,"n_cols":9,"rows_kept":7,"cut":false,"hidden":false,"merged":[[0,0,0,8],[1,0,1,8]]}
["Part 5 - Details"]
["Please complete sheet for all HVAC components/equipment in the building. Refer to Tables 5.2.12.1. and 5.2.12.2. for additional information."]
["Equipment #","Equipment Description","Applicable Table for Equipment Category",null,"Type of Equipment","Cooling or Heating Capacity, kW","Performance Testing Standard","Rating Conditions","Minimum Performance"]
[{"$f":"ROW(A4)-3","v":1},null,null,{"$f":"VLOOKUP(C4,'Validation Reference Page 1'!$A$20:$B$36,2,FALSE)","v":{"$error":"#N/A"}}]
[{"$f":"ROW(A5)-3","v":2},null,null,{"$f":"VLOOKUP(C5,'Validation Reference Page 1'!$A$20:$B$36,2,FALSE)","v":{"$error":"#N/A"}}]
[3,null,null,{"$f":"VLOOKUP(C6,'Validation Reference Page 1'!$A$20:$B$36,2,FALSE)","v":{"$error":"#N/A"}}]
[4,null,null,{"$f":"VLOOKUP(C7,'Validation Reference Page 1'!$A$20:$B$36,2,FALSE)","v":{"$error":"#N/A"}}]

{"sheet":"Part 6 - Details","index":5,"n_rows":7,"n_cols":10,"rows_kept":7,"cut":false,"hidden":false,"merged":[[0,0,0,9],[1,0,1,9]]}
["Part 6 - Details"]
["Please complete sheet for all SWH components/equipment in the building. Refer to Table 6.2.2.1. for additional information."]
["Equipment #","Equipment Description","Category from Table 6.2.2.1.",null,"Type of Equipment","Volume of Tank, Vs), L","Input/Vs , W/L","Performance Testing Standard","Rating Conditions","Performance Requirement"]
[{"$f":"ROW(A4)-3","v":1},null,null,{"$f":"VLOOKUP(C4,'Validation Reference Page 1'!$J$17:$K$20,2, FALSE)","v":{"$error":"#N/A"}}]
[{"$f":"ROW(A5)-3","v":2},null,null,{"$f":"VLOOKUP(C5,'Validation Reference Page 1'!$J$17:$K$20,2, FALSE)","v":{"$error":"#N/A"}}]
[{"$f":"ROW(A6)-3","v":3},null,null,{"$f":"VLOOKUP(C6,'Validation Reference Page 1'!$J$17:$K$20,2, FALSE)","v":{"$error":"#N/A"}}]
[{"$f":"ROW(A7)-3","v":4},null,null,{"$f":"VLOOKUP(C7,'Validation Reference Page 1'!$J$17:$K$20,2, FALSE)","v":{"$error":"#N/A"}}]

{"sheet":"Validation Reference Page 1","index":6,"n_rows":105,"n_cols":12,"rows_kept":105,"cut":false,"hidden":true,"merged":[]}
[null,null,"Climate Zone",null,null,"City ","Zone"]
["Yes",null,"Zone 4 < 3000 HDD",2,null,null,null,null,"Type of Building"]
["No",null,"Zone 5 3000 to 3999 HDD",3,null,null,null,null,"New"]
["N/A",null,"Zone 6 4000 to 4999 HDD",4,null,null,null,null,"Addition"]
[null,null,"Zone 7A 5000 to 5999 HDD",5,null,null,null,null,"Alteration to existing building constructed to the NECB"]
[null,null,"Zone 7B 6000 to 6999 HDD",6]
[null,null,"Zone 8 ≥ 7000 HDD",7,null,null,null,null,"Building Area Method"]
[null,null,null,null,null,null,null,null,"Space-by-Space Method"]
[]
["Help Messages"]
["Message 1","Certain NECB requirements are climatic zone dependant. Please refer to Table C-1 to find the number of heating degree-days (HDD) for your building location and enter the number of HDDs for your building location. If the building is semi-heated, select the appropriate value from the 'Degree-Days Below 15C' column and enter the value under the \"Heating Degree Days 15C\" field."]
["Message 2","A building with a design set-point temperature less than 15C is considered to be 'semi-heated'."]
["Message 3","For additional information on calculating building envelope areas, please refer to Appendix Note A-3.1.1.6.(1)."]
[]
[]
[]
[null,null,null,null,null,null,null,null,null,"Electric-Powered Service Water Heater","Electric"]
[null,null,null,null,null,null,null,null,null,"Fuel-Fired Service Water Heaters","Fuel"]
[null,null,null,null,null,null,null,null,null,"Solar Thermal Service Water Heaters","Solar"]
["5.2.12.1.-A","A","Single-package, space-constrained",null,null,null,null,null,null,"Water Heaters for Pools","Pool"]
{"$rows_left_out":86}
{"sheet":"Code Tables","index":7,"n_rows":151,"n_cols":32,"rows_kept":151,"cut":false,"hidden":true,"merged":[]}
[null,"Part 3"]
[null,"Table 3.2.2.2.",null,null,null,null,null,null,null,"Table 3.2.2.3.",null,null,null,null,null,null,null,"Table 3.2.2.4.",null,null,null,null,null,null,null,"Table 3.2.3.1."]
[null,"Above Ground Opaque Building Assembly","Zone 4: <3000","Zone 5: 3000 to 3999","Zone 6: 4000 to 4999","Zone 7A: 5000 to 5999","Zone 7B: 6000 to 6999","Zone 8: ≥ 7000",null,"Component",{"$f":"C3","v":"Zone 4: <3000"},"Zone 5: 3000 to 3999","Zone 6: 4000 to 4999","Zone 7A: 5000 to 5999","Zone 7B: 6000 to 6999","Zone 8: ≥ 7000",null,"Component",{"$f":"C3","v":"Zone 4: <3000"},"Zone 5: 3000 to 3999","Zone 6: 4000 to 4999","Zone 7A: 5000 to 5999","Zone 7B: 6000 to 6999","Zone 8: ≥ 7000",null,"Assemblies in Contact with the Ground",{"$f":"C3","v":"Zone 4: <3000"},"Zone 5: 3000 to 3999","Zone 6: 4000 to 4999","Zone 7A: 5000 to 5999","Zone 7B: 6000 to 6999","Zone 8: ≥ 7000"]
[null,"Wall",0.28999999999999998,0.26500000000000001,0.24,0.215,0.19,0.16500000000000001,null,"Vertical Fenestration",1.9,1.9,1.73,1.73,1.44,1.44,null,"All Doors",2.12,1.9,1.9,1.9,1.9,1.44,null,"Walls",0.56799999999999995,0.379,0.28399999999999997,0.28399999999999997,0.28399999999999997,0.21]
[null,"Roof",0.16400000000000001,0.156,0.13800000000000001,0.121,0.11700000000000001,0.11,null,"Skylights",2.69,2.69,2.41,2.41,2.0099999999999998,2.0099999999999998,null,null,null,null,null,null,null,null,null,"Roofs",0.56799999999999995,0.379,0.28399999999999997,0.28399999999999997,0.28399999999999997,0.21]
[null,"Floor",0.193,0.17499999999999999,0.156,0.13800000000000001,0.121,0.11700000000000001,null,null,null,null,null,null,null,null,null,null,null,null,null,null,null,null,null,"Floors",0.75700000000000001,0.75700000000000001,0.75700000000000001,0.75700000000000001,0.75700000000000001,0.379]
[null,"Vertical Fenestration",{"$f":"K4","v":1.9},{"$f":"L4","v":1.9},1.73,1.73,1.44,1.44]
[null,"Skylights",{"$f":"K5","v":2.69},{"$f":"L5","v":2.69},2.41,2.41,2.0099999999999998,2.0099999999999998]
[null,"Doors",{"$f":"S4","v":2.12},{"$f":"T4","v":1.9},1.9,1.9,1.9,1.44]
[null,"Underground Walls",{"$f":"AA4","v":0.56799999999999995},{"$f":"AB4","v":0.379},0.28399999999999997,0.28399999999999997,0.28399999999999997,0.21]
[null,"Underground Roofs",{"$f":"AA5","v":0.56799999999999995},0.379,0.28399999999999997,0.28399999999999997,0.28399999999999997,0.21]
[null,"Underground Floors",0.75700000000000001,0.75700000000000001,0.75700000000000001,0.75700000000000001,0.75700000000000001,0.379]
[]
[null,"FDWR Requirements Article 3.2.1.4.",null,null,null,null,null,null,"Part 4",null,null,null,null,null,null,null,"Part 5"]
[null,{"$f":"C3","v":"Zone 4: <3000"},"Zone 5: 3000 to 3999","Zone 6: 4000 to 4999","Zone 7A: 5000 to 5999","Zone 7B: 6000 to 6999","Zone 8: ≥ 7000",null,"Lighting Power Density by Building Type for Use with the Building Area Method",null,null,null,null,null,null,null,"Demand Control Ventilation Threshold for Commercial Kitchen Ventilation Systems"]
[1,0.4,0.4,{"$f":"(2000-(0.2*IF('Project Information'!$C$22=\"No\",HDD,HDD_15)))/3000","v":0.66666666666666663},{"$f":"(2000-(0.2*IF('Project Information'!$C$22=\"No\",HDD,HDD_15)))/3000","v":0.66666666666666663},{"$f":"(2000-(0.2*IF('Project Information'!$C$22=\"No\",HDD,HDD_15)))/3000","v":0.66666666666666663},0.2,null,"Forming Part of Sentences 4.2.1.5.(1), (4) and (5)",null,null,null,null,null,null,null,null,{"$f":"C3","v":"Zone 4: <3000"},"Zone 5: 3000 to 3999","Zone 6: 4000 to 4999","Zone 7A: 5000 to 5999","Zone 7B: 6000 to 6999","Zone 8: ≥ 7000"]
[null,null,null,null,null,null,null,null,"Building Type","Lighting Power Density, W/m2",null,null,null,null,null,null,"value","≥2360","≥2360","≥1880","≥1410","≥1410","≥1410"]
[null,null,null,null,null,null,null,null,"Automotive facility",8.1]
[null,null,null,null,null,null,null,null,"Convention centre",6.9]
[null,null,null,null,null,null,null,null,"Courthouse",8.5]
{"$rows_left_out":131}